{"text_format":"1","workbook":"xlsx","n_sheets":4,"sheets":["Data Definition","2024-2026 tracker","ITNs","Drop down"],"not_rendered":{"charts":0,"images":0,"macros":1,"external_links":0,"defined_names":11,"comments":8,"pivot_tables":0},"unopened":[],"bounds":{"document_bytes":16777216,"sheet_cells":100000,"rows_first":2000,"rows_last":500,"rows_between":2000,"halvings":0,"cell_chars":16384,"cell_head_chars":4096},"cells_cut":0,"cells_raw":0,"read":"whole","date_system":"1900"}

{"sheet":"Data Definition","index":0,"n_rows":59,"n_cols":6,"rows_kept":59,"cut":false,"hidden":false,"merged":[[25,2,29,2],[25,3,29,3],[2,0,2,3],[25,0,29,0]]}
["ITN Mass Campaign Tracker 2024-2026"]
[]
["The ITN Mass Campaign Tracker has been developed for national malaria programmes and partners to have greater visibility of planned ITN mass campaigns and their status. It is a “living document” outlining the campaigns scheduled for the next three years, encompassing the total ITN requirement (campaign + routine/CD), the total number of ITNs funded, etc. The data presented here is gathered from Global Fund applications, PMI malaria operational plans, and ongoing communication with national malaria programs via RBM. \n- Updates to the table will be made quarterly.\n- The date of the update can be used to determine whether there is new information available for a country. "]
[]
["Variable ","Variable Definition","Type","Example",null,"Comments / discussion points for the call"]
["Country","Name of country","Text","Angola"]
["Geographic target","Geographic target refers to the specific geographic areas or regions targeted for the campaign. \"National\" indicates targeting at the level of the entire country, while \"Sub-national\" indicates targeting at a more localized level, such as specific regions, districts, or communities within the country.\n- National\n- Sub-national","Drop down","National"]
["Campaign rollout strategy","The ITN campaign rollout strategy outlines how the distribution methods for ITN will be executed.\n- Single-phase distribution, where all ITNs are distributed at once.\n- Rolling distribution, where ITNs are distributed continuously over a period.\n- Multi-phase distribution, involving multiple stages of distribution over time (e.g. pilot distribution first and then remaining targeted areas)\n- Not available, indicating that specific details on the distribution strategy are not provided or accessible","Drop down","National rolling",null,"Are the proposed options still valid?\nDo we want to merge the geographic target and  roll out strategy?"]
["Detailed geographic target ","The detailed geographic target specifies the approach to prioritizing the distribution of ITNs within a country, particularly in relation to urban and non-urban areas, when deprioritization is occurring. \nThe options include\n- National focus with prioritization of ITNs in urban areas over non-urban areas,\n- National focus with prioritization of ITNs in non-urban areas over urban areas, or\n- No prioritization.\n","Drop down","No deprioritization",null,"Do we wish to monitor this?"]
["State/Region/Province or equivalent","Disaggregated data or information by states, province, or region where available","Text","National"]
["Name of the district or equivalent","Disaggregated data or information by district (or equivalent) level where available","Text","Sub-national"]
["Integration","Integration refers to the coordination between different components within the National Malaria Control Program both internally and externally. Internally, integration involves the alignment between interventions such as Seasonal Malaria Chemoprevention (SMC), Indoor Residual Spraying (IRS), and Malaria Vaccine programs. Externally, integration refers to the NMCP's coordination with other health programs like the Expanded Program on Immunization (EPI), Neglected Tropical Diseases (NTDs), and Vitamin A supplementation initiatives.\n- Internal NMCP - SCM, IRS, Malaria Vaccine\n- External NMCP- EPI, NTDs, Vit A (e.g. administration of vitamin A and/or mebendazole, polio vaccination, and so on).\n- Microplanning\n- Digital Platform\n- No integration\n","Drop down","External NMCP- EPI, NTDs, Vit A",null,"Are there any further integrations of ITN distribution with other health interventions that should be considered/added?"]
["Distribution strategy","- Door to door: distribution teams go from house to house to directly distribute ITNs to residents.\n- Fixed distribution sites:  designated sites such as health centers, schools, or other community locations are set up where beneficiaries can go to receive their ITNs.\n- Hybrid approach: For example, a distribution campaign might start with door-to-door distribution in scattered rural areas, followed by fixed distribution sites in urban or densely populated areas.\n"]
["Previous campaign - Month & Year - MMM-YY","The calendar year when the previous campaign occurred, specified by the stated year, serves as a reference point to verify if the ongoing campaign is a continuation from the previous year.","Date","2021-11-01"]
["Planned ITN distribution campaign year ","Calendar year campaign will take place, stated in year","Year",2023]
["Month planned (start date) for distribution (in GF grant or PMI MOP or other)","Planned date for start of campaign activity in month/year","Date","2021-11-01"]
["Population targeted","Number of people targeted for the mass ITN campaign disaggregated to sub-national levels if available","Number",100000]
["Number of ITNs planned for campaign distribution ","ITNs planned for the campaign based on RBM gap analysis or national malaria programme information","Number",100000]
["ITN type","AlphaCypermethrin + Chlorfenapyr (IG2)\nPyrethroid-Chlorfenapyr (CFP Dual a.i.)\nPyrethroid+Piperonyl Butoxide -PBO\nPyrethroid-ONLY (standard)\nPyrethroid-pyriproxyfen\nOther\nMulti-products","Drop down","CFP Dual a.i"]
["Net brand  (hidden on the AMP website)","Brand of the ITN (not publicly disclosed on the AMP website)","Drop down"]
{"$rows_left_out":40}
{"sheet":"2024-2026 tracker","index":1,"n_rows":490,"n_cols":63,"rows_kept":490,"cut":false,"hidden":false,"merged":[[6,21,6,23],[6,24,6,25],[6,16,6,17]]}
["ITN Maaa Campaign Tracker 2024-2026"]
[]
[]
[]
[]
[]
[null,null,null,null,null,null,null,null,null,null,null,null,null,null,null,null,"Funding partner",null,null,null,null,"Digitalization",null,null,"Waste management"]
["Country","Environment  - Rainy season period","Planned ITN distribution campaign year ","Geographic target",null,"Distribution strategy","Detailed geographic target  (if prioritization of specific areas for ITN distribution)","State/Region/Province or equivalent","Name of the district or equivalent","Integration","Month planned (start date) for distribution","Population targeted","ITN Types","Total ","Distribution completion month - \nMMM-YY","Comments on distribution","Funding partner for commodities","Funding partner for operations","Current campaign phase","ITN delivery status","Campaign status based on currently planned dates","Campaign components that will be digitalized","Scale of digital data collection","Platform being used","Packaging type of nets (individual/bulk)","Waste management approach","Comments/ details on status"]
["Afghanistan","Spring rainy season: The first rainy season occurs during spring, typically from March to May. During this time, rainfall is more frequent in the northern and central regions of the country, including Kabul and the Hindu Kush mountain range.\nSummer Rainy Season: The second rainy season occurs during summer, usually from June to September. This period is characterized by the arrival of the southwest monsoon, which brings heavy rainfall to the southern and eastern parts of Afghanistan, particularly in the provinces bordering Pakistan.",2024,"No campaign this year",null,null,"National focus with prioritization of ITNs in non-urban areas over urban areas","Nangarhar","Behsood & Chaprahar",null,"2024-02-24",null,"Multi-products",{"$f":"IF(M9=ITNs!$E$8, ITNs!E9, IF(M9=ITNs!$B$8, ITNs!B9, IF(M9=ITNs!$C$8, ITNs!C9, IF(M9=ITNs!$D$8, ITNs!D9, IF(M9=ITNs!$E$8, ITNs!E9, IF(M9=ITNs!$F$8, ITNs!F9, IF(M9=ITNs!$G$8, ITNs!G9, IF(M9=ITNs!$H$8, ITNs!H9, \"ERROR\"))))))))","v":300000},null,null,null,null,null,null,null,null,null,null,null,null,"This is routine. No campaign in 2024"]
["Afghanistan","Spring Rainy Season: The first rainy season occurs during spring, typically from March to May. During this time, rainfall is more frequent in the northern and central regions of the country, including Kabul and the Hindu Kush mountain range.\nSummer Rainy Season: The second rainy season occurs during summer, usually from June to September. This period is characterized by the arrival of the southwest monsoon, which brings heavy rainfall to the southern and eastern parts of Afghanistan, particularly in the provinces bordering Pakistan.",2025,null,null,null,null,null,null,null,null,null,"PBO",{"$f":"IF(M10=ITNs!$E$8, ITNs!E10, IF(M10=ITNs!$B$8, ITNs!B10, IF(M10=ITNs!$C$8, ITNs!C10, IF(M10=ITNs!$D$8, ITNs!D10, IF(M10=ITNs!$E$8, ITNs!E10, IF(M10=ITNs!$F$8, ITNs!F10, IF(M10=ITNs!$G$8, ITNs!G10, IF(M10=ITNs!$H$8, ITNs!H10, \"ERROR\"))))))))","v":2579711},null,null,null,null,null,null,null,"Microplanning",null,null,null,null,"Next campaign is planned in 2025, only around 300,000 BPO-nets provided with the support of WHO/WHE, will be distributed in some targeted districts that are not covered since more than 3 years, and this distribution is planned for Behsood district of Nangarhar and then Chaprahar district"]
["Afghanistan","Spring Rainy Season: The first rainy season occurs during spring, typically from March to May. During this time, rainfall is more frequent in the northern and central regions of the country, including Kabul and the Hindu Kush mountain range.\nSummer Rainy Season: The second rainy season occurs during summer, usually from June to September. This period is characterized by the arrival of the southwest monsoon, which brings heavy rainfall to the southern and eastern parts of Afghanistan, particularly in the provinces bordering Pakistan.",2026,null,null,null,null,null,null,null,null,null,"PBO",{"$f":"IF(M11=ITNs!$E$8, ITNs!E11, IF(M11=ITNs!$B$8, ITNs!B11, IF(M11=ITNs!$C$8, ITNs!C11, IF(M11=ITNs!$D$8, ITNs!D11, IF(M11=ITNs!$E$8, ITNs!E11, IF(M11=ITNs!$F$8, ITNs!F11, IF(M11=ITNs!$G$8, ITNs!G11, IF(M11=ITNs!$H$8, ITNs!H11, \"ERROR\"))))))))","v":211953}]
["Angola","Short Rainy Season: The first rainy season, known as the short rainy season or \"small rains,\" typically occurs from September to November. \nLong Rainy Season: The second rainy season usually takes place from December to April.",2024,"No campaign this year",null,null,null,null,null,null,null,null,"Multi-products",{"$f":"IF(M12=ITNs!$E$8, ITNs!E12, IF(M12=ITNs!$B$8, ITNs!B12, IF(M12=ITNs!$C$8, ITNs!C12, IF(M12=ITNs!$D$8, ITNs!D12, IF(M12=ITNs!$E$8, ITNs!E12, IF(M12=ITNs!$F$8, ITNs!F12, IF(M12=ITNs!$G$8, ITNs!G12, IF(M12=ITNs!$H$8, ITNs!H12, \"ERROR\"))))))))","v":288643}]
["Angola",null,2025,null,null,null,null,"10 Provinces to be covered in 2024",null,null,null,null,"Multi-products",{"$f":"IF(M13=ITNs!$E$8, ITNs!E13, IF(M13=ITNs!$B$8, ITNs!B13, IF(M13=ITNs!$C$8, ITNs!C13, IF(M13=ITNs!$D$8, ITNs!D13, IF(M13=ITNs!$E$8, ITNs!E13, IF(M13=ITNs!$F$8, ITNs!F13, IF(M13=ITNs!$G$8, ITNs!G13, IF(M13=ITNs!$H$8, ITNs!H13, \"ERROR\"))))))))","v":4515723},null,null,"PMI "]
["Angola",null,2026,"No campaign this year",null,null,null,null,null,null,null,null,"Multi-products",{"$f":"IF(M14=ITNs!$E$8, ITNs!E14, IF(M14=ITNs!$B$8, ITNs!B14, IF(M14=ITNs!$C$8, ITNs!C14, IF(M14=ITNs!$D$8, ITNs!D14, IF(M14=ITNs!$E$8, ITNs!E14, IF(M14=ITNs!$F$8, ITNs!F14, IF(M14=ITNs!$G$8, ITNs!G14, IF(M14=ITNs!$H$8, ITNs!H14, \"ERROR\"))))))))","v":688360}]
["Bangladesh","Pre-Monsoon Season: usually begins in April and continues through May with thunderstorms and occasional rainfall occur.\nMonsoon Season: The monsoon season generally starts in June and extends through September. ",2024,null,null,null,null,null,null,null,null,null,"Pyrethroid-only",{"$f":"IF(M15=ITNs!$E$8, ITNs!E15, IF(M15=ITNs!$B$8, ITNs!B15, IF(M15=ITNs!$C$8, ITNs!C15, IF(M15=ITNs!$D$8, ITNs!D15, IF(M15=ITNs!$E$8, ITNs!E15, IF(M15=ITNs!$F$8, ITNs!F15, IF(M15=ITNs!$G$8, ITNs!G15, IF(M15=ITNs!$H$8, ITNs!H15, \"ERROR\"))))))))","v":108155}]
["Bangladesh",null,2025,null,null,null,null,null,null,null,null,null,"Pyrethroid-only",{"$f":"IF(M16=ITNs!$E$8, ITNs!E16, IF(M16=ITNs!$B$8, ITNs!B16, IF(M16=ITNs!$C$8, ITNs!C16, IF(M16=ITNs!$D$8, ITNs!D16, IF(M16=ITNs!$E$8, ITNs!E16, IF(M16=ITNs!$F$8, ITNs!F16, IF(M16=ITNs!$G$8, ITNs!G16, IF(M16=ITNs!$H$8, ITNs!H16, \"ERROR\"))))))))","v":84374}]
["Bangladesh",null,2026,null,null,null,null,null,null,null,null,null,"Pyrethroid-only",{"$f":"IF(M17=ITNs!$E$8, ITNs!E17, IF(M17=ITNs!$B$8, ITNs!B17, IF(M17=ITNs!$C$8, ITNs!C17, IF(M17=ITNs!$D$8, ITNs!D17, IF(M17=ITNs!$E$8, ITNs!E17, IF(M17=ITNs!$F$8, ITNs!F17, IF(M17=ITNs!$G$8, ITNs!G17, IF(M17=ITNs!$H$8, ITNs!H17, \"ERROR\"))))))))","v":823614}]
["Benin - ROUTINE","Rainy Season: Generally from April to October, with peak rainfall in July and August.",2024,"No campaign this year",null,null,null,null,null,null,null,null,"Dual a.i.",{"$f":"IF(M18=ITNs!$E$8, ITNs!E18, IF(M18=ITNs!$B$8, ITNs!B18, IF(M18=ITNs!$C$8, ITNs!C18, IF(M18=ITNs!$D$8, ITNs!D18, IF(M18=ITNs!$E$8, ITNs!E18, IF(M18=ITNs!$F$8, ITNs!F18, IF(M18=ITNs!$G$8, ITNs!G18, IF(M18=ITNs!$H$8, ITNs!H18, \"ERROR\"))))))))","v":27223}]
["Benin",null,2025,null,null,null,null,null,null,null,null,null,"Dual a.i.",{"$f":"IF(M19=ITNs!$E$8, ITNs!E19, IF(M19=ITNs!$B$8, ITNs!B19, IF(M19=ITNs!$C$8, ITNs!C19, IF(M19=ITNs!$D$8, ITNs!D19, IF(M19=ITNs!$E$8, ITNs!E19, IF(M19=ITNs!$F$8, ITNs!F19, IF(M19=ITNs!$G$8, ITNs!G19, IF(M19=ITNs!$H$8, ITNs!H19, \"ERROR\"))))))))","v":6787230}]
["Benin - ROUTINE",null,2026,null,null,null,null,null,null,null,null,null,"Dual a.i.",{"$f":"IF(M20=ITNs!$E$8, ITNs!E20, IF(M20=ITNs!$B$8, ITNs!B20, IF(M20=ITNs!$C$8, ITNs!C20, IF(M20=ITNs!$D$8, ITNs!D20, IF(M20=ITNs!$E$8, ITNs!E20, IF(M20=ITNs!$F$8, ITNs!F20, IF(M20=ITNs!$G$8, ITNs!G20, IF(M20=ITNs!$H$8, ITNs!H20, \"ERROR\"))))))))","v":29167}]
{"$rows_left_out":471}
{"sheet":"ITNs","index":2,"n_rows":490,"n_cols":69,"rows_kept":490,"cut":false,"hidden":false,"merged":[]}
["ITNs Number by Type - table to fill-in"]
[]
[]
[]
[]
[]
[]
["Country ","Dual a.i.","Pyrethroid-only","PBO","Other type","Multi-products",null,null,null,"Dual a.i.","AlphaCypermethrin + Chlorfenapyr (IG2)"]
["Afghanistan",null,null,300000,null,{"$f":"SUM(B9:E9)","v":300000},null,null,null,null,"Pyrethroid-Chlorfenapyr (CFP Dual a.i.)"]
["Afghanistan",null,null,2579711,null,{"$f":"SUM(B10:E10)","v":2579711},null,null,null,null,"Piperonyl Butoxide and Pyrethroid (PPF Dual a.i)"]
["Afghanistan",null,null,211953,null,{"$f":"SUM(B11:E11)","v":211953},null,null,null,"Standard","Pyrethroid-ONLY (standard)"]
["Angola",99516,189127,null,null,{"$f":"SUM(B12:E12)","v":288643},null,null,null,"PBO","Pyrethroid+Piperonyl Butoxide (PBO)"]
["Angola",1751430,2764293,null,null,{"$f":"SUM(B13:E13)","v":4515723},null,null,null,"Other","i.e. Damara nets - for sleeping outside"]
["Angola",238422,449938,null,null,{"$f":"SUM(B14:E14)","v":688360}]
["Bangladesh",null,108155,null,null,{"$f":"SUM(B15:E15)","v":108155}]
["Bangladesh",null,84374,null,null,84374]
["Bangladesh",null,823614,null,null,823614]
["Benin - ROUTINE",27223,null,null,null,{"$f":"SUM(B18:E18)","v":27223}]
["Benin",6787230,null,null,null,{"$f":"SUM(B19:E19)","v":6787230}]
["Benin - ROUTINE",29167,null,null,null,{"$f":"SUM(B20:E20)","v":29167}]
{"$rows_left_out":471}
{"sheet":"Drop down","index":3,"n_rows":28,"n_cols":19,"rows_kept":28,"cut":false,"hidden":false,"merged":[]}
[]
[]
["Region","Environment  - Rainy season period","Geographic target","Campaign rollout strategy","Distribution strategy","Detailed geographic target  (if prioritization of specific areas for ITN distribution)","Integration",null,"ITN type","Net brand \n(hidden on the AMP website)","Funding partner (if applicable)","Current campaign phase","ITN delivery status","Status ","Campaign components that will be digitalized","Scale of digital data collection","Platform being used","Packaging type of nets (individual/bale)","waste management approach (reverse logistics; incineration; combo etc)"]
["West Africa","Typically from May to October, with peak rainfall occurring between June and September.","National - one phase","Single phase","Door to door","National focus with prioritization of ITNs \"non urban specific\"","Internal NMP - SMC, IRS, Malaria vaccine, Other","Microplanning","Dual AI","Duranet - Shobikaa Impex Private\nLimited ","AMF","Not started","Pending ITN arrival","On track","Macroplanning","National","IASO - Bluesquare","Individual Packaging","Burial "]
["Central Africa","Generally from March to November, with heavy rainfall throughout this period. Some areas may experience two rainy seasons, one from March to May and another from September to November.","National - multi-phases","Rolling distribution","Fixed distribution sites","National focus with prioritization of ITNs in non-urban areas over urban areas","External NMP- EPI, NTDs, Vit A, Other","Digital platform","PBO","DuraNet Plus - Shobikaa Impex Private\nLimited ","Global Fund","Macroplanning","Delivered in-country","At risk","Microplanning","Selected province/region","Commcare (Dimagi)","Bale Packaging","Combination approach"]
["East Africa","Varied depending on the specific country and region. In general, the rainy season occurs from March to May (long rains) and from October to December (short rains), although there can be variations in timing and intensity","Sub-national - one phase ","Multi-phase","Hybrid approach","No prioritization","No integration","SBC","Standard ITN (pyrethroid-only)","Interceptor - BASF SE","Government","Microplanning","Other","Off track","Household registration ","Selected districts","DIGIT-HCM (eGov)",null,"Incineration"]
["Southern Africa","Rainfall patterns vary across different parts of Southern Africa. In general, the rainy season occurs during the Southern Hemisphere summer, from November to March, with peak rainfall typically from December to February.","Sub-national - multi phases","Not available",null,"Mixed ",null,"Supply chain/logistics ","Other","Interceptor G2 - BASF SE","Multiple","Implementation",null,"Complete","Distribution","Other","DHIS2",null,"Reverse Logistics"]
["North Africa","North Africa is generally characterized by arid and semi-arid climates, where rainfall is minimal and irregular. Some areas may experience a rainy season during the winter months, from November to February, but this can vary greatly from year to year.","No campaign this year",null,null,null,null,"Supervision ","Mixed","MAGNet - VKA Polymers pvt. Ltd","PMI ","Complete",null,"Planned","Logistics & in-country supply chain",null,"Kobo/ODK"]
[null,null,null,null,null,null,null,"Monitoring",null,"MiraNet LLIN - A to Z Textiles Mills Ltd","Not available","Not available",null,"Not available","Bale tracking (barcode/QR code scanning) ",null,"NetApp"]
[null,null,null,null,null,null,null,"Other",null,"Olyset Net - Sumitomo Chemical Co\nLtd ","Other","Postponed ",null,null,"Individual ITN tracking (barcode/QR code scanning)",null,"Redrose"]
[null,null,null,null,null,null,null,null,null,"Olyset Plus - Sumitomo Chemical Co\nLtd ",null,"No campaign",null,null,"Supervision",null,"Reveal"]
[null,null,null,null,null,null,null,null,null,"Panda Net 2.0 - Life Ideas Biological\nTechnology Co. Ltd",null,"Pilot implementation",null,null,"Payment ",null,"Bespoke/custom"]
[null,null,null,null,null,null,null,null,null,"PermaNet 2.0 - Vestergaard",null,null,null,null,"Attendance tracking",null,"Other (specify in comments)"]
[null,null,null,null,null,null,null,null,null,"PermaNet 3.0 - Vestergaard",null,null,null,null,"Campaign personnel tracking"]
[null,null,null,null,null,null,null,null,null,"PermaNet Dual - Vestergaard",null,null,null,null,"Training "]
[null,null,null,null,null,null,null,null,null,"Royal guard - Disease Control\nTechnologies LLC",null,null,null,null,"SBC"]
[null,null,"https://www.theglobalfund.org/media/11805/psm_insecticidetreatednets_list_en.pdf",null,null,null,null,null,null,"Royal Sentry - Disease Control\nTechnologies LLC"]
[null,null,null,null,null,null,null,null,null,"Royal Sentry 2.0 - Disease Control\nTechnologies LLC"]
[null,null,null,null,null,null,null,null,null,"SafeNet - Mainpol GmbH "]
[null,null,null,null,null,null,null,null,null,"Tsara Boost - PPP Hollandi DMCC "]
{"$rows_left_out":8}